BDBM50432107 CHEMBL2349565
SMILES Cc1cc(cc(C)c1Nc1nc(Cl)cn([C@@H](COCCF)C2CC2)c1=O)C#N
InChI Key InChIKey=ZPJXPZQIYMLMFF-INIZCTEOSA-N
Data  1 IC50
  Tab Delimited (TSV)   2D SDfile   Computed 3D by Vconf -m prep SDfile
Find this compound or compounds like it in BindingDB:
Activity Spreadsheet -- Enzyme Inhibition Constant Data from BindingDB
Found 1 hit for monomerid = 50432107
TargetCorticotropin-releasing factor receptor 1(Rattus norvegicus (rat))
Bristol-Myers Squibb Research And Development
Curated by ChEMBL
LigandPNGBDBM50432107(CHEMBL2349565)
Affinity DataIC50:  7.40nM. Assay description: Displacement of [125I]-o-CRF from CRF1 receptor in rat frontal cortex homogenate after 2 hrs by gamma counting
In DepthDetails ArticlePubMed